Reaction Details
TargetMatrix metalloproteinase-14
LigandBDBM50104719
Substrate/Competitorn/a
Meas. Tech.ChEMBL_106783 (CHEMBL718390)
Ki 740±n/a nM
Citation Schröder, JHenke, AWenzel, HBrandstetter, HStammler, HGStammler, APfeiffer, WDTschesche, H Structure-based design and synthesis of potent matrix metalloproteinase inhibitors derived from a 6H-1,3,4-thiadiazine scaffold. J Med Chem44:3231-43 (2001) Matrix metalloproteinase-14
Name:Matrix metalloproteinase-14
Type:Protein
Mol. Mass.:65900.19
Organism:Homo sapiens (Human)
Description:P50281
Residue:582
BDBM50104719
NameBDBM50104719
Synonyms:(S)-N-(5-(4-chlorophenyl)-6H-1,3,4-thiadiazin-2-yl)-3-methyl-2-(phenylsulfonamido)butanamide CHEMBL109603
TypeSmall organic molecule
Emp. Form.C20H21ClN4O3S2
Mol. Mass.464.989
SMILESCC(C)[C@H](NS(=O)(=O)c1ccccc1)C(=O)NC1=NN=C(CS1)c1ccc(Cl)cc1