Reaction Details
TargetMatrix metalloproteinase-9
LigandBDBM50104710
Substrate/Competitorn/a
Meas. Tech.ChEMBL_105381 (CHEMBL710801)
Ki 80±n/a nM
Citation Schröder, JHenke, AWenzel, HBrandstetter, HStammler, HGStammler, APfeiffer, WDTschesche, H Structure-based design and synthesis of potent matrix metalloproteinase inhibitors derived from a 6H-1,3,4-thiadiazine scaffold. J Med Chem44:3231-43 (2001) Matrix metalloproteinase-9
Name:Matrix metalloproteinase-9
Type:Enzyme
Mol. Mass.:78452.28
Organism:Homo sapiens (Human)
Description:P14780
Residue:707
BDBM50104710
NameBDBM50104710
Synonyms:(R)-N-(5-(4-chlorophenyl)-6H-1,3,4-thiadiazin-2-yl)-2-(phenylsulfonamido)propanamide CHEMBL109353
TypeSmall organic molecule
Emp. Form.C18H17ClN4O3S2
Mol. Mass.436.936
SMILESC[C@@H](NS(=O)(=O)c1ccccc1)C(=O)NC1=NN=C(CS1)c1ccc(Cl)cc1