Reaction Details
TargetMatrix metalloproteinase-9
LigandBDBM50104714
Substrate/Competitorn/a
Meas. Tech.ChEMBL_105381 (CHEMBL710801)
Ki 800±n/a nM
Citation Schröder, JHenke, AWenzel, HBrandstetter, HStammler, HGStammler, APfeiffer, WDTschesche, H Structure-based design and synthesis of potent matrix metalloproteinase inhibitors derived from a 6H-1,3,4-thiadiazine scaffold. J Med Chem44:3231-43 (2001) Matrix metalloproteinase-9
Name:Matrix metalloproteinase-9
Type:Enzyme
Mol. Mass.:78452.28
Organism:Homo sapiens (Human)
Description:P14780
Residue:707
BDBM50104714
NameBDBM50104714
Synonyms:CHEMBL109861 | N-[5-(4-Chloro-phenyl)-6H-[1,3,4]thiadiazin-2-yl]-2-(thiophene-2-sulfonylamino)-propionamide
TypeSmall organic molecule
Emp. Form.C16H15ClN4O3S3
Mol. Mass.442.963
SMILESC[C@H](NS(=O)(=O)c1cccs1)C(=O)NC1=NN=C(CS1)c1ccc(Cl)cc1