Reaction Details
TargetMatrix metalloproteinase-14
LigandBDBM50104711
Substrate/Competitorn/a
Meas. Tech.ChEMBL_106783 (CHEMBL718390)
Ki 320±n/a nM
Citation Schröder, JHenke, AWenzel, HBrandstetter, HStammler, HGStammler, APfeiffer, WDTschesche, H Structure-based design and synthesis of potent matrix metalloproteinase inhibitors derived from a 6H-1,3,4-thiadiazine scaffold. J Med Chem44:3231-43 (2001) Matrix metalloproteinase-14
Name:Matrix metalloproteinase-14
Type:Protein
Mol. Mass.:65900.19
Organism:Homo sapiens (Human)
Description:P50281
Residue:582
BDBM50104711
NameBDBM50104711
Synonyms:2-Benzenesulfonylamino-N-[5-(5-chloro-thiophen-2-yl)-6H-[1,3,4]thiadiazin-2-yl]-propionamide | CHEMBL111678
TypeSmall organic molecule
Emp. Form.C16H15ClN4O3S3
Mol. Mass.442.963
SMILESC[C@H](NS(=O)(=O)c1ccccc1)C(=O)NC1=NN=C(CS1)c1ccc(Cl)s1