Reaction Details
Target72 kDa type IV collagenase
LigandBDBM50104720
Substrate/Competitorn/a
Meas. Tech.ChEMBL_104405 (CHEMBL715008)
Ki 850.0±n/a nM
Citation Schröder, JHenke, AWenzel, HBrandstetter, HStammler, HGStammler, APfeiffer, WDTschesche, H Structure-based design and synthesis of potent matrix metalloproteinase inhibitors derived from a 6H-1,3,4-thiadiazine scaffold. J Med Chem44:3231-43 (2001) 72 kDa type IV collagenase
Name:72 kDa type IV collagenase
Type:Enzyme
Mol. Mass.:73870.36
Organism:Homo sapiens (Human)
Description: P08253
Residue:660
BDBM50104720
NameBDBM50104720
Synonyms:(R)-N-(5-(4-chlorophenyl)-6H-1,3,4-thiadiazin-2-yl)-3-methyl-2-(phenylsulfonamido)butanamide CHEMBL422251
TypeSmall organic molecule
Emp. Form.C20H21ClN4O3S2
Mol. Mass.464.989
SMILESCC(C)[C@@H](NS(=O)(=O)c1ccccc1)C(=O)NC1=NN=C(CS1)c1ccc(Cl)cc1