Reaction Details
TargetNeutrophil collagenase
LigandBDBM50104705
Substrate/Competitorn/a
Meas. Tech.ChEMBL_105197 (CHEMBL713836)
Ki>15000±n/a nM
Citation Schröder, JHenke, AWenzel, HBrandstetter, HStammler, HGStammler, APfeiffer, WDTschesche, H Structure-based design and synthesis of potent matrix metalloproteinase inhibitors derived from a 6H-1,3,4-thiadiazine scaffold. J Med Chem44:3231-43 (2001) Neutrophil collagenase
Name:Neutrophil collagenase
Type:Enzyme
Mol. Mass.:53413.48
Organism:Homo sapiens (Human)
Description:P22894
Residue:467
BDBM50104705
NameBDBM50104705
Synonyms:(S)-N-(5-Adamantan-1-yl-6H-[1,3,4]thiadiazin-2-yl)-2-benzenesulfonylamino-propionamide N-(5-Adamantan-1-yl-6H-[1,3,4]thiadiazin-2-yl)-2-benzenesulfonylamino-propionamide
TypeSmall organic molecule
Emp. Form.C22H28N4O3S2
Mol. Mass.460.613
SMILESC[C@H](NS(=O)(=O)c1ccccc1)C(=O)NC1=NN=C(CS1)C12CC3CC(CC(C3)C1)C2