Reaction Details
TargetNeutrophil collagenase
LigandBDBM50104707
Substrate/Competitorn/a
Meas. Tech.ChEMBL_105197 (CHEMBL713836)
Ki 220±n/a nM
Citation Schröder, JHenke, AWenzel, HBrandstetter, HStammler, HGStammler, APfeiffer, WDTschesche, H Structure-based design and synthesis of potent matrix metalloproteinase inhibitors derived from a 6H-1,3,4-thiadiazine scaffold. J Med Chem44:3231-43 (2001) Neutrophil collagenase
Name:Neutrophil collagenase
Type:Enzyme
Mol. Mass.:53413.48
Organism:Homo sapiens (Human)
Description:P22894
Residue:467
BDBM50104707
NameBDBM50104707
Synonyms:(S)-N-(5-(4-cyanophenyl)-6H-1,3,4-thiadiazin-2-yl)-2-(phenylsulfonamido)propanamide CHEMBL422250
TypeSmall organic molecule
Emp. Form.C19H17N5O3S2
Mol. Mass.427.5
SMILESC[C@H](NS(=O)(=O)c1ccccc1)C(=O)NC1=NN=C(CS1)c1ccc(cc1)C#N