Reaction Details
TargetMacrophage metalloelastase
LigandBDBM50104721
Substrate/Competitorn/a
Meas. Tech.ChEMBL_106458 (CHEMBL719130)
Ki 520±n/a nM
Citation Schröder, JHenke, AWenzel, HBrandstetter, HStammler, HGStammler, APfeiffer, WDTschesche, H Structure-based design and synthesis of potent matrix metalloproteinase inhibitors derived from a 6H-1,3,4-thiadiazine scaffold. J Med Chem44:3231-43 (2001) Macrophage metalloelastase
Name:Macrophage metalloelastase
Type:Enzyme
Mol. Mass.:54012.99
Organism:Homo sapiens (Human)
Description:P39900
Residue:470
BDBM50104721
NameBDBM50104721
Synonyms:(S)-N-(5-(4-chlorophenyl)-6H-1,3,4-thiadiazin-2-yl)-2-(phenylsulfonamido)propanamide CHEMBL111257
TypeSmall organic molecule
Emp. Form.C18H17ClN4O3S2
Mol. Mass.436.936
SMILESC[C@H](NS(=O)(=O)c1ccccc1)C(=O)NC1=NN=C(CS1)c1ccc(Cl)cc1