Reaction Details
TargetMatrix metalloproteinase-9
LigandBDBM50104962
Substrate/Competitorn/a
Meas. Tech.ChEMBL_105382 (CHEMBL710802)
Ki 162±n/a nM
Citation Yao, WWasserman, ZRChao, MReddy, GShi, ELiu, RQCovington, MBArner, ECPratta, MATortorella, MMagolda, RLNewton, RQian, MRibadeneira, MDChrist, DWexler, RRDecicco, CP Design and synthesis of a series of (2R)-N(4)-hydroxy-2-(3-hydroxybenzyl)-N(1)- [(1S,2R)-2-hydroxy-2,3-dihydro-1H-inden-1-yl]butanediamide derivatives as potent, selective, and orally bioavailable aggrecanase inhibitors. J Med Chem44:3347-50 (2001) Matrix metalloproteinase-9
Name:Matrix metalloproteinase-9
Type:Enzyme
Mol. Mass.:78452.28
Organism:Homo sapiens (Human)
Description:P14780
Residue:707
BDBM50104962
NameBDBM50104962
Synonyms:CHEMBL325048 | N*4*-Hydroxy-N*1*-(2-hydroxy-indan-1-yl)-2-isobutyl-succinamide
TypeSmall organic molecule
Emp. Form.C17H24N2O4
Mol. Mass.320.3835
SMILESCC(C)C[C@H](CC(=O)NO)C(=O)N[C@@H]1[C@H](O)Cc2ccccc12