Reaction Details
TargetNeutrophil collagenase
LigandBDBM50104967
Substrate/Competitorn/a
Meas. Tech.ChEMBL_105198 (CHEMBL713837)
Ki 0.450000±n/a nM
Citation Yao, WWasserman, ZRChao, MReddy, GShi, ELiu, RQCovington, MBArner, ECPratta, MATortorella, MMagolda, RLNewton, RQian, MRibadeneira, MDChrist, DWexler, RRDecicco, CP Design and synthesis of a series of (2R)-N(4)-hydroxy-2-(3-hydroxybenzyl)-N(1)- [(1S,2R)-2-hydroxy-2,3-dihydro-1H-inden-1-yl]butanediamide derivatives as potent, selective, and orally bioavailable aggrecanase inhibitors. J Med Chem44:3347-50 (2001) Neutrophil collagenase
Name:Neutrophil collagenase
Type:Enzyme
Mol. Mass.:53413.48
Organism:Homo sapiens (Human)
Description:P22894
Residue:467
BDBM50104967
NameBDBM50104967
Synonyms:CHEMBL419751 | N*4*-Hydroxy-2-(4-hydroxy-benzyl)-N*1*-[2-(4-methoxy-phenyl)-1-methylcarbamoyl-ethyl]-succinamide
TypeSmall organic molecule
Emp. Form.C22H27N3O6
Mol. Mass.429.4663
SMILESCNC(=O)[C@H](Cc1ccc(OC)cc1)NC(=O)[C@@H](CC(=O)NO)Cc1ccc(O)cc1