Reaction Details
TargetTelomerase reverse transcriptase
LigandBDBM24709
Substrate/Competitorn/a
Meas. Tech.ChEMBL_210225 (CHEMBL816665)
IC50 8200±n/a nM
Citation West, CFrancis, RFriedman, SH Small molecule/nucleic acid affinity chromatography: application for the identification of telomerase inhibitors which target its key RNA/DNA heteroduplex. Bioorg Med Chem Lett11:2727-30 (2001) Telomerase reverse transcriptase
Name:Telomerase reverse transcriptase
Type:PROTEIN
Mol. Mass.:127099.03
Organism:Homo sapiens (Human)
Description:ChEMBL_1447029
Residue:1132
BDBM24709
NameBDBM24709
Synonyms:6,9-Diamino-2-Ethoxyacridine CHEMBL94007
TypeSmall organic molecule
Emp. Form.C15H15N3O
Mol. Mass.253.2991
SMILESCCOc1ccc2nc3cc(N)ccc3c(N)c2c1