Reaction Details
TargetSomatostatin receptor type 2
LigandBDBM50105466
Substrate/Competitorn/a
Meas. Tech.ChEBML_200992
IC50 2.9±n/a nM
Citation Hay, BACole, BMDiCapua, FMKirk, GWMurray, MCNardone, RAPelletier, DJRicketts, APRobertson, ASSiegel, TW Small molecule somatostatin receptor subtype-2 antagonists. Bioorg Med Chem Lett11:2731-4 (2001) Somatostatin receptor type 2
Name:Somatostatin receptor type 2
Type:Enzyme
Mol. Mass.:41344.94
Organism:Homo sapiens (Human)
Description:P30874
Residue:369
BDBM50105466
NameBDBM50105466
Synonyms:(S)-6-Amino-2-[(R)-2-[(4-benzenesulfonyl-piperazine-1-carbonyl)-amino]-3-(1H-indol-3-yl)-propionylamino]-hexanoic acid tert-butyl ester | CHEMBL329684
TypeSmall organic molecule
Emp. Form.C32H44N6O6S
Mol. Mass.640.793
SMILESCC(C)(C)OC(=O)[C@H](CCCCN)NC(=O)[C@@H](Cc1c[nH]c2ccccc12)NC(=O)N1CCN(CC1)S(=O)(=O)c1ccccc1