Reaction Details
TargetSomatostatin receptor type 2
LigandBDBM50105471
Substrate/Competitorn/a
Meas. Tech.ChEMBL_200991 (CHEMBL801242)
IC50 7700±n/a nM
Citation Hay, BACole, BMDiCapua, FMKirk, GWMurray, MCNardone, RAPelletier, DJRicketts, APRobertson, ASSiegel, TW Small molecule somatostatin receptor subtype-2 antagonists. Bioorg Med Chem Lett11:2731-4 (2001) Somatostatin receptor type 2
Name:Somatostatin receptor type 2
Type:Enzyme
Mol. Mass.:41344.94
Organism:Homo sapiens (Human)
Description:P30874
Residue:369
BDBM50105471
NameBDBM50105471
Synonyms:(S)-6-Amino-2-((R)-3-(1H-indol-3-yl)-2-{[4-(toluene-4-sulfonyl)-piperazine-1-carbonyl]-amino}-propionylamino)-hexanoic acid tert-butyl ester | CHEMBL91696
TypeSmall organic molecule
Emp. Form.C33H46N6O6S
Mol. Mass.654.82
SMILESCc1ccc(cc1)S(=O)(=O)N1CCN(CC1)C(=O)N[C@H](Cc1c[nH]c2ccccc12)C(=O)N[C@@H](CCCCN)C(=O)OC(C)(C)C