Reaction Details
TargetSomatostatin receptor type 2
LigandBDBM50105472
Substrate/Competitorn/a
Meas. Tech.ChEMBL_200991 (CHEMBL801242)
IC50 120±n/a nM
Citation Hay, BACole, BMDiCapua, FMKirk, GWMurray, MCNardone, RAPelletier, DJRicketts, APRobertson, ASSiegel, TW Small molecule somatostatin receptor subtype-2 antagonists. Bioorg Med Chem Lett11:2731-4 (2001) Somatostatin receptor type 2
Name:Somatostatin receptor type 2
Type:Enzyme
Mol. Mass.:41344.94
Organism:Homo sapiens (Human)
Description:P30874
Residue:369
BDBM50105472
NameBDBM50105472
Synonyms:(S)-6-Amino-2-[(R)-2-[(1-benzenesulfonyl-piperidine-4-carbonyl)-amino]-3-(1H-indol-3-yl)-propionylamino]-hexanoic acid tert-butyl ester | CHEMBL329824
TypeSmall organic molecule
Emp. Form.C33H45N5O6S
Mol. Mass.639.805
SMILESCC(C)(C)OC(=O)[C@H](CCCCN)NC(=O)[C@@H](Cc1c[nH]c2ccccc12)NC(=O)C1CCN(CC1)S(=O)(=O)c1ccccc1