Reaction Details
TargetD(3) dopamine receptor
LigandBDBM50054067
Substrate/Competitorn/a
Meas. Tech.ChEBML_62292
Ki 8±n/a nM
Citation Lehmann, THübner, HGmeiner, P Dopaminergic 7-aminotetrahydroindolizines: ex-chiral pool synthesis and preferential D3 receptor binding. Bioorg Med Chem Lett11:2863-6 (2001) D(3) dopamine receptor
Name:D(3) dopamine receptor
Type:n/a
Mol. Mass.:44243.43
Organism:Homo sapiens (Human)
Description:n/a
Residue:400
BDBM50054067
NameBDBM50054067
Synonyms:(2R)-7-Dipropylamino-5,6,7,8-tetrahydro-naphthalen-2-ol (R)-7-(dipropylamino)-5,6,7,8-tetrahydronaphthalen-2-ol (R)-7-Dipropylamino-5,6,7,8-tetrahydro-naphthalen-2-ol.HCl CHEMBL301559
TypeSmall organic molecule
Emp. Form.C16H25NO
Mol. Mass.247.3758
SMILESCCCN(CCC)[C@@H]1CCc2ccc(O)cc2C1