Reaction Details
TargetMelanocortin receptor 5
LigandBDBM50105880
Substrate/Competitorn/a
Meas. Tech.ChEMBL_220876 (CHEMBL824632)
Ki 4.3±n/a nM
Citation Bednarek, MAMacNeil, TKalyani, RNTang, RVan der Ploeg, LHWeinberg, DH Selective, high affinity peptide antagonists of alpha-melanotropin action at human melanocortin receptor 4: their synthesis and biological evaluation in vitro. J Med Chem44:3665-72 (2001) Melanocortin receptor 5
Name:Melanocortin receptor 5
Type:Enzyme
Mol. Mass.:36612.92
Organism:Homo sapiens (Human)
Description:P33032
Residue:325
BDBM50105880
NameBDBM50105880
Synonyms:15-Acetylamino-6-(3-guanidino-propyl)-12-(3H-imidazol-4-ylmethyl)-3-(1H-indol-3-ylmethyl)-9-naphthalen-2-ylmethyl-2,5,8,11,14,17-hexaoxo-1,4,7,10,13,18hexaaza-cyclotricosane-23-carboxylic acid | CHEMBL385465
TypeSmall organic molecule
Emp. Form.C48H60N14O8
Mol. Mass.961.079
SMILESCC(=O)N[C@H]1CC(=O)NCCCC[C@@H](NC(=O)[C@@H](Cc2c[nH]c3ccccc23)NC(=O)[C@H](CCCNC(N)=N)NC(=O)[C@@H](Cc2ccc3ccccc3c2)NC(=O)[C@H](Cc2cnc[nH]2)NC1=O)C(N)=O