Reaction Details
TargetMelanocortin receptor 5
LigandBDBM50105894
Substrate/Competitorn/a
Meas. Tech.ChEMBL_220876 (CHEMBL824632)
Ki 28±n/a nM
Citation Bednarek, MAMacNeil, TKalyani, RNTang, RVan der Ploeg, LHWeinberg, DH Selective, high affinity peptide antagonists of alpha-melanotropin action at human melanocortin receptor 4: their synthesis and biological evaluation in vitro. J Med Chem44:3665-72 (2001) Melanocortin receptor 5
Name:Melanocortin receptor 5
Type:Enzyme
Mol. Mass.:36612.92
Organism:Homo sapiens (Human)
Description:P33032
Residue:325
BDBM50105894
NameBDBM50105894
Synonyms:16-(2-Acetylamino-hexanoylamino)-6-(3-guanidino-propyl)-12-(3H-imidazol-4-ylmethyl)-3-(1H-indol-3-ylmethyl)-9-naphthalen-2-ylmethyl-2,5,8,11,14,17-hexaoxo-1,4,7,10,13,18hexaaza-cyclotricosane-23-carboxylic acid | CHEMBL268851
TypeSmall organic molecule
Emp. Form.C54H71N15O9
Mol. Mass.1074.2366
SMILESCCCC[C@H](NC(C)=O)C(=O)N[C@@H]1CC(=O)N[C@@H](Cc2cnc[nH]2)C(=O)N[C@H](Cc2ccc3ccccc3c2)C(=O)N[C@@H](CCCNC(N)=N)C(=O)N[C@H](Cc2c[nH]c3ccccc23)C(=O)N[C@H](CCCCNC1=O)C(N)=O