Reaction Details
TargetMacrophage migration inhibitory factor
LigandBDBM50458539
Substrate/Competitorn/a
Meas. Tech.ChEMBL_2018482 (CHEMBL4672060)
Kd 9040±n/a nM
Citation Cirillo, PFAsojo, OAKhire, ULee, YMootien, SHegan, PSutherland, AGPeterson-Roth, ELedizet, MKoski, RAAnthony, KG Inhibition of Macrophage Migration Inhibitory Factor by a Chimera of Two Allosteric Binders. ACS Med Chem Lett11:1843-1847 (2020) 
 
Macrophage migration inhibitory factor
Name:Macrophage migration inhibitory factor
Type:Enzyme
Mol. Mass.:12478.18
Organism:Homo sapiens (Human)
Description:P14174
Residue:115
BDBM50458539
NameBDBM50458539
Synonyms:CHICAGO SKY BLUE SODIUM Chicago Sky Blue 6B
TypeSmall organic molecule
Emp. Form.C34H24N6Na4O16S4
Mol. Mass.992.804
SMILES[Na;v0+].[Na;v0+].[Na;v0+].[Na;v0+].[#6]-[#8]-c1cc(ccc1\[#7]=[#7]\c1ccc2c(cc(c(-[#7])c2c1-[#8])S([#8-])(=O)=O)S([#8-])(=O)=O)-c1ccc(\[#7]=[#7]\c2ccc3c(cc(c(-[#7])c3c2-[#8])S([#8-])(=O)=O)S([#8-])(=O)=O)c(-[#8]-[#6])c1