Reaction Details
TargetMacrophage migration inhibitory factor
LigandBDBM50240404
Substrate/Competitorn/a
Meas. Tech.ChEMBL_2018482 (CHEMBL4672060)
Kd 1400±n/a nM
Citation Cirillo, PFAsojo, OAKhire, ULee, YMootien, SHegan, PSutherland, AGPeterson-Roth, ELedizet, MKoski, RAAnthony, KG Inhibition of Macrophage Migration Inhibitory Factor by a Chimera of Two Allosteric Binders. ACS Med Chem Lett11:1843-1847 (2020) 
 
Macrophage migration inhibitory factor
Name:Macrophage migration inhibitory factor
Type:Enzyme
Mol. Mass.:12478.18
Organism:Homo sapiens (Human)
Description:P14174
Residue:115
BDBM50240404
NameBDBM50240404
Synonyms:(Ibudilast)1-(2-Isopropyl-pyrazolo[1,5-a]pyridin-3-yl)-2-methyl-propan-1-one CHEMBL19449 | IBUDILAST
TypeSmall organic molecule
Emp. Form.C14H18N2O
Mol. Mass.230.3055
SMILESCC(C)C(=O)c1c(nn2ccccc12)C(C)C