Reaction Details
TargetMuscarinic acetylcholine receptor M5
LigandBDBM50064176
Substrate/Competitorn/a
Meas. Tech.ChEMBL_139390 (CHEMBL747003)
Ki 313±n/a nM
Citation Melchiorre, CBolognesi, MLBudriesi, RGhelardini, CChiarini, AMinarini, ARosini, MTumiatti, VWade, EJ Design, synthesis, and biological activity of methoctramine-related polyamines as putative G(i) protein activators. J Med Chem44:4035-8 (2001) Muscarinic acetylcholine receptor M5
Name:Muscarinic acetylcholine receptor M5
Type:PROTEIN
Mol. Mass.:60102.35
Organism:Homo sapiens (Human)
Description:ChEMBL_1517990
Residue:532
BDBM50064176
NameBDBM50064176
Synonyms:CHEMBL27673 METHOCTRAMINE N1,N8-bis(6-(2-methoxybenzylamino)hexyl)octane-1,8-diamine
TypeSmall organic molecule
Emp. Form.C36H62N4O2
Mol. Mass.582.9031
SMILESCOc1ccccc1CNCCCCCCNCCCCCCCCNCCCCCCNCc1ccccc1OC