Reaction Details
TargetMuscarinic acetylcholine receptor M3
LigandBDBM50064176
Substrate/Competitorn/a
Meas. Tech.ChEMBL_138697 (CHEMBL747664)
Ki 277±n/a nM
Citation Melchiorre, CBolognesi, MLBudriesi, RGhelardini, CChiarini, AMinarini, ARosini, MTumiatti, VWade, EJ Design, synthesis, and biological activity of methoctramine-related polyamines as putative G(i) protein activators. J Med Chem44:4035-8 (2001) Muscarinic acetylcholine receptor M3
Name:Muscarinic acetylcholine receptor M3
Type:Enzyme
Mol. Mass.:66151.03
Organism:Homo sapiens (Human)
Description:P20309
Residue:590
BDBM50064176
NameBDBM50064176
Synonyms:CHEMBL27673 METHOCTRAMINE N1,N8-bis(6-(2-methoxybenzylamino)hexyl)octane-1,8-diamine
TypeSmall organic molecule
Emp. Form.C36H62N4O2
Mol. Mass.582.9031
SMILESCOc1ccccc1CNCCCCCCNCCCCCCCCNCCCCCCNCc1ccccc1OC