Reaction Details
TargetCarbonic anhydrase 4
LigandBDBM50331834
Substrate/Competitorn/a
Meas. Tech.ChEMBL_2018973 (CHEMBL4672551)
Ki 0.370000±n/a nM
Citation Andring, JTFouch, MAkocak, SAngeli, ASupuran, CTIlies, MAMcKenna, R Structural Basis of Nanomolar Inhibition of Tumor-Associated Carbonic Anhydrase IX: X-Ray Crystallographic and Inhibition Study of Lipophilic Inhibitors with Acetazolamide Backbone. J Med Chem63:13064-13075 (2020) 
 
Carbonic anhydrase 4
Name:Carbonic anhydrase 4
Type:Enzyme
Mol. Mass.:35037.98
Organism:Homo sapiens (Human)
Description:P22748
Residue:312
BDBM50331834
NameBDBM50331834
Synonyms:5-butyramido-2-sulfamoyl-1,3,4-thiadiazole | CHEMBL1288787
TypeSmall organic molecule
Emp. Form.C6H10N4O3S2
Mol. Mass.250.299
SMILESCCCC(=O)Nc1nnc(s1)S(N)(=O)=O