Reaction Details
TargetEstrogen receptor
LigandBDBM19459
Substrate/Competitorn/a
Meas. Tech.ChEMBL_220736 (CHEMBL841902)
EC50 20±n/a nM
Citation Meyers, MJSun, JCarlson, KEMarriner, GAKatzenellenbogen, BSKatzenellenbogen, JA Estrogen receptor-beta potency-selective ligands: structure-activity relationship studies of diarylpropionitriles and their acetylene and polar analogues. J Med Chem44:4230-51 (2001) Estrogen receptor
Name:Estrogen receptor
Type:Protein
Mol. Mass.:66230.44
Organism:Homo sapiens (Human)
Description:P03372
Residue:595
BDBM19459
NameBDBM19459
Synonyms:5,7-dihydroxy-3-(4-hydroxyphenyl)-4H-chromen-4-one Genistein Genisteol US8552057, 2 | cid_5280961
TypePhytoestrogen
Emp. Form.C15H10O5
Mol. Mass.270.2369
SMILESOc1ccc(cc1)-c1coc2cc(O)cc(O)c2c1=O