Reaction Details
TargetEstrogen receptor
LigandBDBM50106637
Substrate/Competitorn/a
Meas. Tech.ChEMBL_220736 (CHEMBL841902)
EC50 0.38±n/a nM
Citation Meyers, MJSun, JCarlson, KEMarriner, GAKatzenellenbogen, BSKatzenellenbogen, JA Estrogen receptor-beta potency-selective ligands: structure-activity relationship studies of diarylpropionitriles and their acetylene and polar analogues. J Med Chem44:4230-51 (2001) Estrogen receptor
Name:Estrogen receptor
Type:Protein
Mol. Mass.:66230.44
Organism:Homo sapiens (Human)
Description:P03372
Residue:595
BDBM50106637
NameBDBM50106637
Synonyms:4-[2-(4-hydroxyphenyl)-3-pentynyl]phenol | CHEMBL136039
TypeSmall organic molecule
Emp. Form.C17H16O2
Mol. Mass.252.3077
SMILESCC#CC(Cc1ccc(O)cc1)c1ccc(O)cc1