Reaction Details
TargetInterstitial collagenase
LigandBDBM50106655
Substrate/Competitorn/a
Meas. Tech.ChEMBL_105943 (CHEMBL714693)
IC50 34±n/a nM
Citation Rabinowitz, MHAndrews, RCBecherer, JDBickett, DMBubacz, DGConway, JGCowan, DJGaul, MGlennon, KLambert, MHLeesnitzer, MAMcDougald, DLMoss, MLMusso, DLRizzolio, MC Design of selective and soluble inhibitors of tumor necrosis factor-alpha converting enzyme (TACE). J Med Chem44:4252-67 (2001) Interstitial collagenase
Name:Interstitial collagenase
Type:Enzyme
Mol. Mass.:54010.26
Organism:Homo sapiens (Human)
Description: P03956
Residue:469
BDBM50106655
NameBDBM50106655
Synonyms:(2R,3R)-N-{(1R)-4-Nitroguanyl-1-[(1,3-thiazol-2-ylamino)carbonyl]butyl}-3-[formyl(hydroxy)amino]-2-isobutylhexanamide | CHEMBL336425
TypeSmall organic molecule
Emp. Form.C20H34N8O6S
Mol. Mass.514.599
SMILESCCC[C@@H]([C@@H](CC(C)C)C(=O)N[C@@H](CCCN=C(N)N[N+]([O-])=O)C(=O)Nc1nccs1)N(O)C=O