Reaction Details
TargetStromelysin-1
LigandBDBM50106655
Substrate/Competitorn/a
Meas. Tech.ChEMBL_104568 (CHEMBL714851)
IC50 31±n/a nM
Citation Rabinowitz, MHAndrews, RCBecherer, JDBickett, DMBubacz, DGConway, JGCowan, DJGaul, MGlennon, KLambert, MHLeesnitzer, MAMcDougald, DLMoss, MLMusso, DLRizzolio, MC Design of selective and soluble inhibitors of tumor necrosis factor-alpha converting enzyme (TACE). J Med Chem44:4252-67 (2001) Stromelysin-1
Name:Stromelysin-1
Type:Enzyme
Mol. Mass.:53973.13
Organism:Homo sapiens (Human)
Description: P08254
Residue:477
BDBM50106655
NameBDBM50106655
Synonyms:(2R,3R)-N-{(1R)-4-Nitroguanyl-1-[(1,3-thiazol-2-ylamino)carbonyl]butyl}-3-[formyl(hydroxy)amino]-2-isobutylhexanamide | CHEMBL336425
TypeSmall organic molecule
Emp. Form.C20H34N8O6S
Mol. Mass.514.599
SMILESCCC[C@@H]([C@@H](CC(C)C)C(=O)N[C@@H](CCCN=C(N)N[N+]([O-])=O)C(=O)Nc1nccs1)N(O)C=O