Reaction Details
TargetReverse transcriptase/RNaseH
LigandBDBM50024581
Substrate/Competitorn/a
Meas. Tech.ChEMBL_195836 (CHEMBL799135)
IC50 138000±n/a nM
Citation Chamorro, CLobatón, EBonache, MCDe Clercq, EBalzarini, JVelázquez, SSan-Félix, ACamarasa, MJ Identification of a novel family of nucleosides that specifically inhibit HIV-1 reverse transcriptase. Bioorg Med Chem Lett11:3085-8 (2001) Reverse transcriptase/RNaseH
Name:Reverse transcriptase/RNaseH
Type:PROTEIN
Mol. Mass.:65229.15
Organism:Human immunodeficiency virus 1
Description:ChEMBL_1473730
Residue:566
BDBM50024581
NameBDBM50024581
Synonyms:CHEMBL3142813
TypeSmall organic molecule
Emp. Form.C24H44N2O8Si2
Mol. Mass.544.7858
SMILESCc1cn([C@@H]2O[C@H](CO[Si](C)(C)C(C)(C)C)[C@@H](O)[C@H]2O[Si](C)(C)C(C)(C)C)c(=O)n(CC(O)=O)c1=O