Reaction Details
TargetReverse transcriptase/RNaseH
LigandBDBM50403883
Substrate/Competitorn/a
Meas. Tech.ChEBML_195690
EC50 32000±n/a nM
Citation Chamorro, CLobatón, EBonache, MCDe Clercq, EBalzarini, JVelázquez, SSan-Félix, ACamarasa, MJ Identification of a novel family of nucleosides that specifically inhibit HIV-1 reverse transcriptase. Bioorg Med Chem Lett11:3085-8 (2001) Reverse transcriptase/RNaseH
Name:Reverse transcriptase/RNaseH
Type:PROTEIN
Mol. Mass.:65229.15
Organism:Human immunodeficiency virus 1
Description:ChEMBL_1473730
Residue:566
BDBM50403883
NameBDBM50403883
Synonyms:CHEMBL3142815 | CHEMBL431822
TypeSmall organic molecule
Emp. Form.C30H58N2O8Si3
Mol. Mass.659.0466
SMILESCc1cn([C@@H]2O[C@H](CO[Si](C)(C)C(C)(C)C)[C@@H](O[Si](C)(C)C(C)(C)C)[C@H]2O[Si](C)(C)C(C)(C)C)c(=O)n(CC(O)=O)c1=O