Reaction Details
TargetPapain
LigandBDBM22857
Substrate/Competitorn/a
Meas. Tech.ChEBML_152640
IC50 91000±n/a nM
Citation Singh, SBGraham, PLReamer, RACordingley, MG Discovery, total synthesis, HRV 3C-protease inhibitory activity, and structure-activity relationships of 2-methoxystypandrone and its analogues. Bioorg Med Chem Lett11:3143-6 (2001) Papain
Name:Papain
Type:Enzyme
Mol. Mass.:38923.01
Organism:Carica papaya
Description:Papain was purchased from Sigma, Germany.
Residue:345
BDBM22857
NameBDBM22857
Synonyms:1,2-Dione-Based Compound, 14 CHEMBL51931 cid_6763
TypeSmall organic molecule
Emp. Form.C14H8O2
Mol. Mass.208.2121
SMILESO=C1C(=O)c2ccccc2-c2ccccc12