Reaction Details
TargetIntegrin alpha-L
LigandBDBM50107164
Substrate/Competitorn/a
Meas. Tech.ChEMBL_88946 (CHEMBL699117)
IC50 10±n/a nM
Citation Winn, MReilly, EBLiu, GHuth, JRJae, HSFreeman, JPei, ZXin, ZLynch, JKester, Jvon Geldern, TWLeitza, SDeVries, PDickinson, RMussatto, DOkasinski, GF Discovery of novel p-arylthio cinnamides as antagonists of leukocyte function-associated antigen-1/intercellular adhesion molecule-1 interaction. 4. Structure-activity relationship of substituents on the benzene ring of the cinnamide. J Med Chem44:4393-403 (2001) Integrin alpha-L
Name:Integrin alpha-L
Type:PROTEIN
Mol. Mass.:128748.90
Organism:Homo sapiens (Human)
Description:ChEMBL_629045
Residue:1170
BDBM50107164
NameBDBM50107164
Synonyms:3-[2,3-Dichloro-4-(2-methoxy-phenylsulfanyl)-phenyl]-1-morpholin-4-yl-propenone | CHEMBL344897
TypeSmall organic molecule
Emp. Form.C20H19Cl2NO3S
Mol. Mass.424.341
SMILESCOc1ccccc1Sc1ccc(\C=C\C(=O)N2CCOCC2)c(Cl)c1Cl