Reaction Details
TargetIntegrin alpha-L
LigandBDBM50107168
Substrate/Competitorn/a
Meas. Tech.ChEMBL_88938 (CHEMBL699110)
IC50 3±n/a nM
Citation Winn, MReilly, EBLiu, GHuth, JRJae, HSFreeman, JPei, ZXin, ZLynch, JKester, Jvon Geldern, TWLeitza, SDeVries, PDickinson, RMussatto, DOkasinski, GF Discovery of novel p-arylthio cinnamides as antagonists of leukocyte function-associated antigen-1/intercellular adhesion molecule-1 interaction. 4. Structure-activity relationship of substituents on the benzene ring of the cinnamide. J Med Chem44:4393-403 (2001) Integrin alpha-L
Name:Integrin alpha-L
Type:PROTEIN
Mol. Mass.:128748.90
Organism:Homo sapiens (Human)
Description:ChEMBL_629045
Residue:1170
BDBM50107168
NameBDBM50107168
Synonyms:1-{3-[4-(2,3-Dihydro-benzo[1,4]dioxin-6-ylsulfanyl)-2,3-bis-trifluoromethyl-phenyl]-acryloyl}-piperidine-4-carboxylic acid | CHEMBL337562
TypeSmall organic molecule
Emp. Form.C25H21F6NO5S
Mol. Mass.561.493
SMILESOC(=O)C1CCN(CC1)C(=O)\C=C\c1ccc(Sc2ccc3OCCOc3c2)c(c1C(F)(F)F)C(F)(F)F