Reaction Details
TargetSigma non-opioid intracellular receptor 1
LigandBDBM50107212
Substrate/Competitorn/a
Meas. Tech.ChEMBL_223691 (CHEMBL846101)
Ki 1.21±n/a nM
Citation Huang, YHammond, PSWu, LMach, RH Synthesis and structure-activity relationships of N-(1-benzylpiperidin-4-yl)arylacetamide analogues as potent sigma1 receptor ligands. J Med Chem44:4404-15 (2001) Sigma non-opioid intracellular receptor 1
Name:Sigma non-opioid intracellular receptor 1
Type:Enzyme Catalytic Domain
Mol. Mass.:25124.85
Organism:Homo sapiens (Human)
Description:Q99720
Residue:223
BDBM50107212
NameBDBM50107212
Synonyms:2-(3-Bromo-phenyl)-N-[1-(4-fluoro-benzyl)-piperidin-4-yl]-acetamide | CHEMBL334568
TypeSmall organic molecule
Emp. Form.C20H22BrFN2O
Mol. Mass.405.304
SMILESFc1ccc(CN2CCC(CC2)NC(=O)Cc2cccc(Br)c2)cc1