Reaction Details
TargetSigma non-opioid intracellular receptor 1
LigandBDBM50107225
Substrate/Competitorn/a
Meas. Tech.ChEMBL_223691 (CHEMBL846101)
Ki 1.15±n/a nM
Citation Huang, YHammond, PSWu, LMach, RH Synthesis and structure-activity relationships of N-(1-benzylpiperidin-4-yl)arylacetamide analogues as potent sigma1 receptor ligands. J Med Chem44:4404-15 (2001) Sigma non-opioid intracellular receptor 1
Name:Sigma non-opioid intracellular receptor 1
Type:Enzyme Catalytic Domain
Mol. Mass.:25124.85
Organism:Homo sapiens (Human)
Description:Q99720
Residue:223
BDBM50107225
NameBDBM50107225
Synonyms:2-(3-Chloro-phenyl)-N-[1-(4-fluoro-benzyl)-piperidin-4-yl]-acetamide | CHEMBL139340
TypeSmall organic molecule
Emp. Form.C20H22ClFN2O
Mol. Mass.360.853
SMILESFc1ccc(CN2CCC(CC2)NC(=O)Cc2cccc(Cl)c2)cc1