Reaction Details
TargetGlucocorticoid receptor
LigandBDBM50107356
Substrate/Competitorn/a
Meas. Tech.ChEMBL_44515 (CHEMBL658539)
EC50 34±n/a nM
Citation Elmore, SWCoghlan, MJAnderson, DDPratt, JKGreen, BEWang, AXStashko, MALin, CWTyree, CMMiner, JNJacobson, PBWilcox, DMLane, BC Nonsteroidal selective glucocorticoid modulators: the effect of C-5 alkyl substitution on the transcriptional activation/repression profile of 2,5-dihydro-10-methoxy-2,2,4-trimethyl-1H-[1]benzopyrano[3,4-f]quinolines. J Med Chem44:4481-91 (2001) Glucocorticoid receptor
Name:Glucocorticoid receptor
Type:Enzyme
Mol. Mass.:85656.87
Organism:Homo sapiens (Human)
Description:P04150
Residue:777
BDBM50107356
NameBDBM50107356
Synonyms:10-Methoxy-2,2,4-trimethyl-5-prop-2-ynyl-2,5-dihydro-1H-6-oxa-1-aza-chrysene | CHEMBL138098
TypeSmall organic molecule
Emp. Form.C23H23NO2
Mol. Mass.345.4342
SMILESCOc1cccc2OC(CC#C)c3c(ccc4NC(C)(C)C=C(C)c34)-c12