Reaction Details
TargetPlatelet-activating factor acetylhydrolase
LigandBDBM50107483
Substrate/Competitorn/a
Meas. Tech.ChEBML_101009
IC50 2.6±n/a nM
Citation Boyd, HFFell, SCHickey, DMIfe, RJLeach, CAMacphee, CHMilliner, KJPinto, ILRawlings, DASmith, SAStansfield, IGStanway, SJTheobald, CJWhittaker, CM Potent, orally active inhibitors of lipoprotein-associated phospholipase A(2): 1-(biphenylmethylamidoalkyl)-pyrimidones. Bioorg Med Chem Lett12:51-5 (2001) Platelet-activating factor acetylhydrolase
Name:Platelet-activating factor acetylhydrolase
Type:PROTEIN
Mol. Mass.:50084.41
Organism:Homo sapiens (Human)
Description:ChEMBL_156212
Residue:441
BDBM50107483
NameBDBM50107483
Synonyms:CHEMBL346439 | N-(4'-Cyano-biphenyl-4-ylmethyl)-2-[2-(4-fluoro-benzylsulfanyl)-5-(1-methyl-1H-pyrazol-4-ylmethyl)-4-oxo-4H-pyrimidin-1-yl]-N-methyl-acetamide
TypeSmall organic molecule
Emp. Form.C33H29FN6O2S
Mol. Mass.592.686
SMILESCN(Cc1ccc(cc1)-c1ccc(cc1)C#N)C(=O)Cn1cc(Cc2cnn(C)c2)c(=O)nc1SCc1ccc(F)cc1