Reaction Details
TargetPlatelet-activating factor acetylhydrolase
LigandBDBM50107499
Substrate/Competitorn/a
Meas. Tech.ChEBML_101009
IC50 8±n/a nM
Citation Boyd, HFFell, SCHickey, DMIfe, RJLeach, CAMacphee, CHMilliner, KJPinto, ILRawlings, DASmith, SAStansfield, IGStanway, SJTheobald, CJWhittaker, CM Potent, orally active inhibitors of lipoprotein-associated phospholipase A(2): 1-(biphenylmethylamidoalkyl)-pyrimidones. Bioorg Med Chem Lett12:51-5 (2001) Platelet-activating factor acetylhydrolase
Name:Platelet-activating factor acetylhydrolase
Type:PROTEIN
Mol. Mass.:50084.41
Organism:Homo sapiens (Human)
Description:ChEMBL_156212
Residue:441
BDBM50107499
NameBDBM50107499
Synonyms:4-[2-(4-Fluoro-benzylsulfanyl)-5-(1-methyl-1H-pyrazol-4-ylmethyl)-4-oxo-4H-pyrimidin-1-yl]-N-(4'-fluoro-biphenyl-4-ylmethyl)-N-methyl-butyramide | CHEMBL440360
TypeSmall organic molecule
Emp. Form.C34H33F2N5O2S
Mol. Mass.613.72
SMILESCN(Cc1ccc(cc1)-c1ccc(F)cc1)C(=O)CCCn1cc(Cc2cnn(C)c2)c(=O)nc1SCc1ccc(F)cc1