Reaction Details
TargetPlatelet-activating factor acetylhydrolase
LigandBDBM50107507
Substrate/Competitorn/a
Meas. Tech.ChEBML_101009
IC50 0.500000±n/a nM
Citation Boyd, HFFell, SCHickey, DMIfe, RJLeach, CAMacphee, CHMilliner, KJPinto, ILRawlings, DASmith, SAStansfield, IGStanway, SJTheobald, CJWhittaker, CM Potent, orally active inhibitors of lipoprotein-associated phospholipase A(2): 1-(biphenylmethylamidoalkyl)-pyrimidones. Bioorg Med Chem Lett12:51-5 (2001) Platelet-activating factor acetylhydrolase
Name:Platelet-activating factor acetylhydrolase
Type:PROTEIN
Mol. Mass.:50084.41
Organism:Homo sapiens (Human)
Description:ChEMBL_156212
Residue:441
BDBM50107507
NameBDBM50107507
Synonyms:CHEMBL358483 | N-(4'-Chloro-biphenyl-4-ylmethyl)-2-[2-(4-fluoro-benzylsulfanyl)-5-(2-methoxy-pyrimidin-5-ylmethyl)-4-oxo-4H-pyrimidin-1-yl]-acetamide
TypeSmall organic molecule
Emp. Form.C32H27ClFN5O3S
Mol. Mass.616.105
SMILESCOc1ncc(Cc2cn(CC(=O)NCc3ccc(cc3)-c3ccc(Cl)cc3)c(SCc3ccc(F)cc3)nc2=O)cn1