Reaction Details
TargetPlatelet-activating factor acetylhydrolase
LigandBDBM50107510
Substrate/Competitorn/a
Meas. Tech.ChEBML_101009
IC50 4±n/a nM
Citation Boyd, HFFell, SCHickey, DMIfe, RJLeach, CAMacphee, CHMilliner, KJPinto, ILRawlings, DASmith, SAStansfield, IGStanway, SJTheobald, CJWhittaker, CM Potent, orally active inhibitors of lipoprotein-associated phospholipase A(2): 1-(biphenylmethylamidoalkyl)-pyrimidones. Bioorg Med Chem Lett12:51-5 (2001) Platelet-activating factor acetylhydrolase
Name:Platelet-activating factor acetylhydrolase
Type:PROTEIN
Mol. Mass.:50084.41
Organism:Homo sapiens (Human)
Description:ChEMBL_156212
Residue:441
BDBM50107510
NameBDBM50107510
Synonyms:4-[2-(4-Fluoro-benzylsulfanyl)-5-(1-methyl-1H-pyrazol-4-ylmethyl)-4-oxo-4H-pyrimidin-1-yl]-N-(4'-fluoro-biphenyl-4-ylmethyl)-butyramide | CHEMBL150822
TypeSmall organic molecule
Emp. Form.C33H31F2N5O2S
Mol. Mass.599.693
SMILESCn1cc(Cc2cn(CCCC(=O)NCc3ccc(cc3)-c3ccc(F)cc3)c(SCc3ccc(F)cc3)nc2=O)cn1