Reaction Details
TargetMatrix metalloproteinase-9
LigandBDBM50107579
Substrate/Competitorn/a
Meas. Tech.ChEBML_105370
Ki 691±n/a nM
Citation Yao, WChao, MWasserman, ZRLiu, RQCovington, MBNewton, RChrist, DWexler, RRDecicco, CP Potent P1' biphenylmethyl substituted aggrecanase inhibitors. Bioorg Med Chem Lett12:101-4 (2001) Matrix metalloproteinase-9
Name:Matrix metalloproteinase-9
Type:Enzyme
Mol. Mass.:78452.28
Organism:Homo sapiens (Human)
Description:P14780
Residue:707
BDBM50107579
NameBDBM50107579
Synonyms:(R)-N*4*-Hydroxy-N*1*-((1S,2R)-2-hydroxy-indan-1-yl)-2-(3'-methanesulfonylamino-biphenyl-4-ylmethyl)-succinamide | CHEMBL8655
TypeSmall organic molecule
Emp. Form.C27H29N3O6S
Mol. Mass.523.601
SMILESCS(=O)(=O)Nc1cccc(c1)-c1ccc(C[C@H](CC(=O)NO)C(=O)N[C@@H]2[C@H](O)Cc3ccccc23)cc1