Reaction Details
Target72 kDa type IV collagenase
LigandBDBM50107572
Substrate/Competitorn/a
Meas. Tech.ChEBML_104395
Ki<2.8±n/a nM
Citation Yao, WChao, MWasserman, ZRLiu, RQCovington, MBNewton, RChrist, DWexler, RRDecicco, CP Potent P1' biphenylmethyl substituted aggrecanase inhibitors. Bioorg Med Chem Lett12:101-4 (2001) 72 kDa type IV collagenase
Name:72 kDa type IV collagenase
Type:Enzyme
Mol. Mass.:73870.36
Organism:Homo sapiens (Human)
Description: P08253
Residue:660
BDBM50107572
NameBDBM50107572
Synonyms:(R)-N*4*-Hydroxy-N*1*-((1S,2R)-2-hydroxy-indan-1-yl)-2-(2'-methyl-biphenyl-4-ylmethyl)-succinamide | CHEMBL266245
TypeSmall organic molecule
Emp. Form.C27H28N2O4
Mol. Mass.444.5222
SMILESCc1ccccc1-c1ccc(C[C@H](CC(=O)NO)C(=O)N[C@@H]2[C@H](O)Cc3ccccc23)cc1