Reaction Details
Target72 kDa type IV collagenase
LigandBDBM50107571
Substrate/Competitorn/a
Meas. Tech.ChEBML_104395
Ki<1±n/a nM
Citation Yao, WChao, MWasserman, ZRLiu, RQCovington, MBNewton, RChrist, DWexler, RRDecicco, CP Potent P1' biphenylmethyl substituted aggrecanase inhibitors. Bioorg Med Chem Lett12:101-4 (2001) 72 kDa type IV collagenase
Name:72 kDa type IV collagenase
Type:Enzyme
Mol. Mass.:73870.36
Organism:Homo sapiens (Human)
Description: P08253
Residue:660
BDBM50107571
NameBDBM50107571
Synonyms:(R)-2-Biphenyl-4-ylmethyl-N*4*-hydroxy-N*1*-((1S,2R)-2-hydroxy-indan-1-yl)-succinamide | CHEMBL8702
TypeSmall organic molecule
Emp. Form.C26H26N2O4
Mol. Mass.430.4956
SMILESONC(=O)C[C@@H](Cc1ccc(cc1)-c1ccccc1)C(=O)N[C@@H]1[C@H](O)Cc2ccccc12