Reaction Details
Target72 kDa type IV collagenase
LigandBDBM50107573
Substrate/Competitorn/a
Meas. Tech.ChEBML_104395
Ki 43±n/a nM
Citation Yao, WChao, MWasserman, ZRLiu, RQCovington, MBNewton, RChrist, DWexler, RRDecicco, CP Potent P1' biphenylmethyl substituted aggrecanase inhibitors. Bioorg Med Chem Lett12:101-4 (2001) 72 kDa type IV collagenase
Name:72 kDa type IV collagenase
Type:Enzyme
Mol. Mass.:73870.36
Organism:Homo sapiens (Human)
Description: P08253
Residue:660
BDBM50107573
NameBDBM50107573
Synonyms:(2R)-2-[4-(1,3-benzodioxol-5-yl)benzyl]-N~4~-hydroxy-N~1~-[(1S,2R)-2-hydroxy-2,3-dihydro-1H-inden-1-yl]butanediamide CHEMBL8432
TypeSmall organic molecule
Emp. Form.C27H26N2O6
Mol. Mass.474.5051
SMILESONC(=O)C[C@@H](Cc1ccc(cc1)-c1ccc2OCOc2c1)C(=O)N[C@@H]1[C@H](O)Cc2ccccc12