Reaction Details
TargetPoly [ADP-ribose] polymerase 1
LigandBDBM50446130
Substrate/Competitorn/a
Meas. Tech.ChEMBL_2022849 (CHEMBL4676662)
Ki 1.4±n/a nM
Citation Karche, NPBhonde, MSinha, NJana, GKukreja, GKurhade, SPJagdale, ARTilekar, ARHajare, AKJadhav, GRGupta, NRLimaye, RKhedkar, NThube, BRShaikh, JSRao Irlapati, NPhukan, SGole, GBommakanti, AKhanwalkar, HPawar, YKale, RKumar, RGupta, RPraveen Kumar, VRWahid, SFrancis, ABhat, TKamble, NPatil, VNigade, PBModi, DPawar, SNaidu, SVolam, HPagdala, VMallurwar, SGoyal, HBora, PAhirrao, PSingh, MKamalakannan, PNaik, KRKumar, PPowar, RGShankar, RBBernstein, PRGundu, JNemmani, KNarasimham, LGeorge, KSSharma, SBakhle, DKamboj, RKPalle, VP Discovery of isoquinolinone and naphthyridinone-based inhibitors of poly(ADP-ribose) polymerase-1 (PARP1) as anticancer agents: Structure activity relationship and preclinical characterization. Bioorg Med Chem28:0 (2020) 
 
Poly [ADP-ribose] polymerase 1
Name:Poly [ADP-ribose] polymerase 1
Type:n/a
Mol. Mass.:113114.22
Organism:Homo sapiens (Human)
Description:P09874
Residue:1014
BDBM50446130
NameBDBM50446130
Synonyms:AG-014699 RUCAPARIB CAMSYLATE | Rucaparib
TypeSmall organic molecule
Emp. Form.C19H18FN3O
Mol. Mass.323.3641
SMILESCNCc1ccc(cc1)-c1[nH]c2cc(F)cc3C(=O)NCCc1c23