Reaction Details
TargetSubstance-K receptor
LigandBDBM50108271
Substrate/Competitorn/a
Meas. Tech.ChEBML_209195
Ki 1±n/a nM
Citation Shih, NYAlbanese, MAnthes, JCCarruthers, NIGrice, CALin, LMangiaracina, PReichard, GASchwerdt, JSeidl, VWong, SCPiwinski, JJ Synthesis and structure-activity relationships of oxime neurokinin antagonists: discovery of potent arylamides. Bioorg Med Chem Lett12:141-5 (2001) Substance-K receptor
Name:Substance-K receptor
Type:Protein
Mol. Mass.:44455.78
Organism:Homo sapiens (Human)
Description:P21452
Residue:398
BDBM50108271
NameBDBM50108271
Synonyms:CHEMBL32124 | N-{3-(3,4-Dichloro-phenyl)-5-(4-hydroxy-4-phenyl-piperidin-1-yl)-2-[(Z)-methoxyimino]-pentyl}-2-dimethylamino-6,N-dimethyl-isonicotinamide
TypeSmall organic molecule
Emp. Form.C33H41Cl2N5O3
Mol. Mass.626.616
SMILESCO\N=C(/CN(C)C(=O)c1cc(C)nc(c1)N(C)C)C(CCN1CCC(O)(CC1)c1ccccc1)c1ccc(Cl)c(Cl)c1