Reaction Details
TargetMitogen-activated protein kinase kinase kinase 11
LigandBDBM50108294
Substrate/Competitorn/a
Meas. Tech.ChEBML_122394
IC50 94±n/a nM
Citation Murakata, CKaneko, MGessner, GAngeles, TSAtor, MAO'Kane, TMMcKenna, BAThomas, BAMathiasen, JRSaporito, MSBozyczko-Coyne, DHudkins, RL Mixed lineage kinase activity of indolocarbazole analogues. Bioorg Med Chem Lett12:147-50 (2001) Mitogen-activated protein kinase kinase kinase 11
Name:Mitogen-activated protein kinase kinase kinase 11
Type:PROTEIN
Mol. Mass.:92696.93
Organism:Homo sapiens (Human)
Description:ChEMBL_1460565
Residue:847
BDBM50108294
NameBDBM50108294
Synonyms:CHEMBL288818 | Indolocarbazole analogue
TypeSmall organic molecule
Emp. Form.C35H33N3O5S2
Mol. Mass.639.784
SMILESCOC(=O)[C@@]1(O)C[C@H]2O[C@]1(C)n1c3ccc(CSCC=C)cc3c3c4CNC(=O)c4c4c5cc(CSCC=C)ccc5n2c4c13