Reaction Details
TargetMitogen-activated protein kinase kinase kinase 9
LigandBDBM50108291
Substrate/Competitorn/a
Meas. Tech.ChEBML_122391
IC50 43±n/a nM
Citation Murakata, CKaneko, MGessner, GAngeles, TSAtor, MAO'Kane, TMMcKenna, BAThomas, BAMathiasen, JRSaporito, MSBozyczko-Coyne, DHudkins, RL Mixed lineage kinase activity of indolocarbazole analogues. Bioorg Med Chem Lett12:147-50 (2001) Mitogen-activated protein kinase kinase kinase 9
Name:Mitogen-activated protein kinase kinase kinase 9
Type:protein
Mol. Mass.:121881.51
Organism:Homo sapiens (Human)
Description:P80192
Residue:1104
BDBM50108291
NameBDBM50108291
Synonyms:CHEMBL36891 | Indolocarbazole analogue
TypeSmall organic molecule
Emp. Form.C30H27N3O5S
Mol. Mass.541.617
SMILESCCSCc1ccc2n3[C@H]4C[C@](O)(C(=O)OC)[C@](C)(O4)n4c5ccccc5c5c6CNC(=O)c6c(c2c1)c3c45