Reaction Details
TargetAcetylcholinesterase
LigandBDBM120262
Substrate/Competitorn/a
Meas. Tech.ChEBML_28306
IC50 3960±n/a nM
Citation Grove, SJKaur, JMuir, AWPow, ETarver, GJZhang, MQ Oxyaniliniums as acetylcholinesterase inhibitors for the reversal of neuromuscular block. Bioorg Med Chem Lett12:193-6 (2001) Acetylcholinesterase
Name:Acetylcholinesterase
Type:Enzyme
Mol. Mass.:67792.70
Organism:Homo sapiens (Human)
Description:P22303
Residue:614
BDBM120262
NameBDBM120262
Synonyms:EDROPHONIUM BROMIDE Edrophonium cid_8307
TypeSmall organic molecule
Emp. Form.C10H16NO
Mol. Mass.166.2396
SMILESCC[N+](C)(C)c1cccc(O)c1