Reaction Details
TargetSorbitol dehydrogenase
LigandBDBM50108732
Substrate/Competitorn/a
Meas. Tech.ChEMBL_201003 (CHEMBL801253)
IC50 8±n/a nM
Citation Chu-Moyer, MYBallinger, WEBeebe, DABerger, RCoutcher, JBDay, WWLi, JMylari, BLOates, PJWeekly, RM Orally-effective, long-acting sorbitol dehydrogenase inhibitors: synthesis, structure-activity relationships, and in vivo evaluations of novel heterocycle-substituted piperazino-pyrimidines. J Med Chem45:511-28 (2002) Sorbitol dehydrogenase
Name:Sorbitol dehydrogenase
Type:PROTEIN
Mol. Mass.:38332.20
Organism:Homo sapiens (Human)
Description:ChEMBL_223910
Residue:357
BDBM50108732
NameBDBM50108732
Synonyms:1-{4-[4-(3-Methyl-quinoxalin-2-yl)-piperazin-1-yl]-pyrimidin-2-yl}-ethanol | CHEMBL151486
TypeSmall organic molecule
Emp. Form.C19H22N6O
Mol. Mass.350.4176
SMILESC[C@@H](O)c1nccc(n1)N1CCN(CC1)c1nc2ccccc2nc1C