Reaction Details
TargetDNA polymerase beta
LigandBDBM50109029
Substrate/Competitorn/a
Meas. Tech.ChEMBL_50295 (CHEMBL660415)
Ki 20100±n/a nM
Citation Watanabe, MHanashima, SMizushina, YYoshida, HOshige, MSakaguchi, KSugawara, F Biotinylated lithocholic acids for affinity chromatography of mammalian DNA polymerases alpha and beta. Bioorg Med Chem Lett12:287-90 (2002) DNA polymerase beta
Name:DNA polymerase beta
Type:PROTEIN
Mol. Mass.:38334.34
Organism:Rattus norvegicus
Description:ChEMBL_1361926
Residue:335
BDBM50109029
NameBDBM50109029
Synonyms:4-{10,13-Dimethyl-3-[3-(6-{6-[5-(2-oxo-hexahydro-thieno[3,4-d]imidazol-6-yl)-pentanoylamino]-hexanoylamino}-hexanoylamino)-propionyloxy]-hexadecahydro-cyclopenta[a]phenanthren-17-yl}-pentanoic acid | CHEMBL3137892
TypeSmall organic molecule
Emp. Form.C49H81N5O8S
Mol. Mass.900.261
SMILES[H][C@@](C)(CCC(O)=O)[C@@]1([H])CC[C@@]2([H])[C@]3([H])CCC4C[C@H](CC[C@]4(C)[C@@]3([H])CC[C@]12C)OC(=O)CCNC(=O)CCCCCNC(=O)CCCCCNC(=O)CCCCC1SCC2NC(=O)NC12