Reaction Details
TargetInterstitial collagenase
LigandBDBM50291702
Substrate/Competitorn/a
Meas. Tech.ChEMBL_106133 (CHEMBL718681)
Ki 6±n/a nM
Citation Sawa, MTsukamoto, TKiyoi, TKurokawa, KNakajima, FNakada, YYokota, KInoue, YKondo, HYoshino, K New strategy for antedrug application: development of metalloproteinase inhibitors as antipsoriatic drugs. J Med Chem45:930-6 (2002) Interstitial collagenase
Name:Interstitial collagenase
Type:Enzyme
Mol. Mass.:54010.26
Organism:Homo sapiens (Human)
Description: P03956
Residue:469
BDBM50291702
NameBDBM50291702
Synonyms:(3-Hydroxycarbamoyl-3,4-dihydro-1H-isoquinolin-2-yl)-(4-methoxy-phenyl)-phosphinic acid 2,2-difluoro-ethyl ester CHEMBL435462
TypeSmall organic molecule
Emp. Form.C19H21F2N2O5P
Mol. Mass.426.351
SMILESCOc1ccc(cc1)[P@](=O)(OCC(F)F)N1Cc2ccccc2C[C@@H]1C(=O)NO